role related to ancient peoples
type: Concept
preferred label: forntidsfolksroll @sv
preferred label: muinaiskansaan liittyvä rooli @fi
narrower: Italic peoples

Italians
type: Concept
preferred label: italialaiset @fi
preferred label: italienare @sv
related: Italic peoples

Italic peoples
type: Concept
preferred label: itaalit @fi
preferred label: italiker @sv
in scheme: conceptscheme
related: Italians
scope note: Italiaan 2. vuosituhannen lopulla eKr. vaeltaneista itaalisia kieliä puhuneista indoeurooppalaisista kansoista käytetty nimitys
source: Lähde: CD-Facta
broader: role related to ancient peoples
alternative label: italer