parts of the body
type: Concept
preferred label: kroppsdelar @sv
preferred label: ruumiinosat @fi
narrower: inner ear

inner ear
type: Concept
comment: ohimoluun sisällä sijaitseva nesteen täyttämä korvan osa, jossa kuulo- ja tasapainoreseptorit sijaitsevat (luinen labyrintti sisältöineen)
source: MOT Lääketiede 2.0a
preferred label: sisäkorva @fi
preferred label: innerörat @sv
part of: ears
broader: parts of the body
in scheme: conceptscheme

ears
type: Concept
preferred label: öronen @sv
preferred label: korvat @fi