versmått
type: Concept
preferred label: runomitat @fi
preferred label: metres @en
in scheme: conceptscheme
scope note: Runomittojen nimiä voi käyttää asiasanoina, esim. heksametri
scope note: Olika versmått kan användas som ämnesord, t.ex. hexameter
narrower: kalevalamått
broader: linguistic phenomena

kalevalamått
type: Concept
preferred label: kalevala metre @en
preferred label: kalevalamitta @fi
broader: versmått

linguistic phenomena
type: Concept
preferred label: kielelliset ilmiöt @fi
narrower: versmått