konstnärshem
type: Concept
preferred label: artists' homes @en
preferred label: taiteilijakodit @fi
narrower: Turjanlinna

Turjanlinna
type: Concept
broader: konstnärshem
scope note: Kirjailija Ilmari Kiannon koti Suomussalmella
in scheme: conceptscheme