representationstillställningar
type: Concept
preferred label: social receptions @en
preferred label: edustustilaisuudet @fi
related: representation

ömsesidig aktivitet
type: Concept
preferred label: mutual activity @en
preferred label: keskinäinen toiminta @fi
narrower: representation

styrelserepresentation
type: Concept
preferred label: staff representation @en
preferred label: hallintoedustus @fi
broader: representation

representation
type: Concept
source: Suomen kielen perussanakirja
in scheme: conceptscheme
narrower: styrelserepresentation
comment: 1) esiintyä tai toimia jonkun puolesta, sijasta, jonkun valtuuttamana, jonkun nimissä; 2) esiintyä jonkin suunnan, mielipiteen tms. kannattajana tai puoltajana; 3) olla jonkin ilmauksena, osoituksena, (esi)merkkinä, ilmentää, merkitä kuvata, esittää; kuulua ominaisuuksiltaan johonkin ryhmään tai lajiin
broader: ömsesidig aktivitet
preferred label: edustus @fi
scope note: edustus + representaatio = representation
related: representationstillställningar