modern art
type: Concept
broader: styles
source: Lähde: CD-Facta
preferred label: moderni taide @fi
preferred label: modern konst @sv
scope note: Kaikki 1870-luvun ranskalaisen impressionismin jälkeen syntynyt ja perinteisestä kuvarealismista irtautunut taide. Impressionismin lisäksi siihen luetaan mm. ekspressionismi, fauvismi, kubismi, futurismi, dadaismi, orfismi, neoplastisismi, konstruktivismi, suprematismi, surrealismi. Tärkein modernin taiteen ilmiö on ollut abstraktin taiteen ja sen eri suuntausten kehittyminen
in scheme: conceptscheme
related: contemporary art

styles
type: Concept
preferred label: tyylit @fi
preferred label: stilar @sv
narrower: modern art

contemporary art
type: Concept
preferred label: nutidskonst @sv
preferred label: nykytaide @fi
related: modern art