näkökulma (fyysiset ominaisuudet)
type: Concept
broader: fyysiset ominaisuudet
alternative label: näkökulma
comment: kulma jonka muodostavat silmää ja jnk kohteen kahta ääripistettä yhdistävät suorat
preferred label: synpunkt @sv
preferred label: visual angle @en
source: Kielitoimiston sanakirja
in scheme: conceptscheme

fyysiset ominaisuudet
type: Concept
preferred label: physical qualities @en
preferred label: fysiska egenskaper @sv
narrower: näkökulma (fyysiset ominaisuudet)