konstnärshem
type: Concept
preferred label: artists' homes @en
preferred label: taiteilijakodit @fi
narrower: Ahola

Ahola
type: Concept
broader: konstnärshem
scope note: Kirjailija Juhani Ahon ja taidemaalari Venny Soldan-Brofeldtin taitelijakoti Järvenpäässä
in scheme: conceptscheme