glykeeminen kuorma
type: Concept
preferred label: glycemic load @en
preferred label: glykemisk belastning @sv
related: glykeeminen indeksi

indeksit
type: Concept
preferred label: indices @en
preferred label: index -- jämförelsetal @sv
narrower: glykeeminen indeksi

glykeeminen indeksi
type: Concept
alternative label: sokeristumisindeksi
alternative label: glykemiaindeksi
alternative label: sockerindex @sv
alternative label: sokeroitumisindeksi
broader: indeksit
preferred label: glykemiskt index @sv
preferred label: glycemic index @en
in scheme: conceptscheme
related: glykeeminen kuorma
scope note: Med glykemiskt index (GI), avses ytan under blodsockerkurvan av en bestämd mängd livsmedel i procent i jämförelse med samma mängd av ett annat livsmedel som referens. @sv