days of the week
scope note: The names of the days of the week can be used as index terms
scope note: Viikonpäivien nimiä voi käyttää asiasanoina @fi
top concept of: conceptscheme
in scheme: conceptscheme
preferred label: viikonpäivät @fi
type: Concept

days of the week
preferred label: veckodagar @sv
preferred label: viikonpäivät @fi
type: Concept