suurperhe
preferred label: extended family @en
type: Concept
related: laajentumaperhe

avioperhe
preferred label: conjugal family @en
type: Concept
related: laajentumaperhe

laajentumaperhe
related: suurperhe
related: avioperhe
broader: perhe
in scheme: conceptscheme
alternative label: laajentumaperheet
preferred label: extended family @en
scope note: Laajentumaperheessä voi puolisoiden ja heidän lastensa lisäksi elää miehen tai vaimon vanhempia, naimattomia sisaruksia tai muita sukulaisia (Lähde: Perinteentutkimuksen terminologia)
scope note: A family that includes in one household near relatives in addition to a nuclear family (Source: Merriam-Webster Dictionary) @en
type: Concept

perhe
preferred label: family @en
type: Concept
narrower: laajentumaperhe