suullinen perinne
preferred label: oral tradition @en
type: Concept
narrower: booklore

booklore
broader: suullinen perinne
scope note: Oral tradition based on written and printed sources (Source: Perinteentutkimuksen terminologia) @en
scope note: Tarkoittaa sellaista suullisen perinteen aineistoa, joka välittömästi tai välillisesti pohjautuu kirjallisiin ja painettuihin lähteisiin
related: kirjalliset lähteet
related: arkkikirjallisuus
in scheme: conceptscheme
type: Concept

arkkikirjallisuus
preferred label: chapbooks @en
type: Concept
related: booklore

kirjalliset lähteet
preferred label: literary sources @en
type: Concept
related: booklore