keskuslämmitys
preferred label: centralvärme @sv
preferred label: central heating @en
type: Concept
narrower: ilmalämmitys

ilmalämmitys
preferred label: luftuppvärmning @sv
preferred label: air heating @en
broader: keskuslämmitys
in scheme: conceptscheme
alternative label: kuumailmalämmitys
alternative label: varmluftsuppvärmning @sv
comment: keskuslämmitys, jossa lämmönsiirtoaineena on ilma
type: Concept
source: Energiasanasto TSK 16