vuosilustot
type: Concept
comment: puun kuoren alle vuosittain kasvava puukerros (joka puun poikkileikkauksessa näkyy vuosirenkaana)
alternative label: lustot
alternative label: vuosirenkaat
preferred label: annual rings @en
preferred label: årsringar @sv
in scheme: conceptscheme
broader: kasvinosat
source: Kielitoimiston sanakirja

kasvinosat
preferred label: växternas beståndsdelar @sv
preferred label: parts of plants @en
type: Concept
narrower: vuosilustot