child protection
preferred label: barnskydd @sv
preferred label: lastensuojelu @fi
type: Concept
narrower: family group conference

family group conference
preferred label: läheisneuvonpito @fi
preferred label: familjerådslag @sv
scope note: Tarkoittaa lastensuojelutyön menetelmää. Tarkoitus on tukea läheisverkostoa löytämään ratkaisu lapsen tilanteeseen
in scheme: conceptscheme
source: Lähde: Läheisneuvonpito - uusi sosiaalityön menetelmä / Tarja Heino (toim.)
broader: child protection
type: Concept