opetusneuvokset (arvonimet)
broader: arvonimet
comment: In singular 'opetusneuvos', in plural 'opetusneuvokset'.
alternative label: opetusneuvokset
in scheme: conceptscheme
preferred label: opetusneuvokset (honorary titles) @en
type: Concept

arvonimet
preferred label: titlar @sv
preferred label: titles @en
type: Concept
narrower: opetusneuvokset (arvonimet)