genbanker
preferred label: gene banks @en
preferred label: geenipankit @fi
type: Concept
related: biobanker

biobanker
related: genbanker
type: Concept
preferred label: biopankit @fi
preferred label: biobanks @en
source: Terminfo 4/2004
in scheme: conceptscheme
scope note: Samling av biologiskt material som förvaras kortare eller längre tid och som är avsedd för forskning, medicinsk diagnostik och behandling samt fortplantning.
scope note: Biopankki on kudosnäytekokoelma, joka sisältää kaiken ihmisperäisen materiaalin ja siihen liittyvät tiedot
alternative label: vävnadsbanker
alternative label: kudospankit @fi
broader: fysisk entitet

fysisk entitet
preferred label: physical whole @en
preferred label: fyysinen kokonaisuus @fi
type: Concept
narrower: biobanker