rinnakkaisvalmisteet
alternative label: generiska preparat @sv
alternative label: geneeriset valmisteet
alternative label: rinnakkaislääkkeet
alternative label: kopiolääkkeet
alternative label: läkemedelskopior @sv
alternative label: geneeriset lääkkeet
preferred label: generic products @en
preferred label: parallellpreparat @sv
in scheme: conceptscheme
type: Concept
scope note: Tarkoittaa valmisteita, joissa on samat vaikuttavat aineet mutta eri valmistenimi
broader: lääkkeet

lääkkeet
preferred label: mediciner @sv
preferred label: medicines @en
type: Concept
narrower: rinnakkaisvalmisteet