role related to ancient peoples
preferred label: forntidsfolksroll @sv
preferred label: muinaiskansaan liittyvä rooli @fi
type: Concept
narrower: hittites

hittites
broader: role related to ancient peoples
source: Kielitoimiston sanakirja
comment: heetti: erään Vähässä-Aasiassa ja Syyriassa eläneen kansan jäsen
in scheme: conceptscheme
preferred label: heettiläiset @fi
preferred label: hettiter @sv
type: Concept