förenande
broader: förändring
comment: 1) kiinnittyä tai sulautua (tahattomasti) yhteen, muodostaa yhtenäinen kokonaisuus 2) tietoisesta toiminnasta: liittyä, kiinnittyä, liittoutua [Suomen kielen perussanakirja]
in scheme: conceptscheme
preferred label: unification @en
preferred label: yhdistyminen @fi
type: Concept

förändring
preferred label: change @en
preferred label: muutos @fi
type: Concept
narrower: förenande