byggnadsrätt -- byggnadsverksamhet
preferred label: permitted building volume @en
preferred label: rakennusoikeus @fi
in scheme: conceptscheme
broader: rättigheter
type: Concept
scope note: Används i betydelsen rätt att bygga. Termen byggnadsrätt (rättsområde) avser rättsområde.
scope note: Tarkoittaa oikeutta rakentamiseen. Oikeudenalaa tarkoitettaessa käytä rakentamisoikeus

rättigheter
preferred label: rights @en
preferred label: oikeudet @fi
type: Concept
narrower: byggnadsrätt -- byggnadsverksamhet