producenter
preferred label: producers @en
preferred label: tuottajat @fi
type: Concept
narrower: tjänsteproducenter

tjänsteproducenter
broader: producenter
scope note: Organisaatio tai yksittäinen henkilö, joka saa aikaan palveluja. Sosiaali- ja terveydenhuollossa palveluntuottajista erotetaan yleensä varsinaiset palvelua antavat organisaatioiden osat tai yksittäiset henkilöt eli palvelunantajat. Esimerkiksi yliopistollinen sairaala voi olla palveluntuottaja ja sen silmäpoliklinikka palvelunantaja
in scheme: conceptscheme
preferred label: service producers @en
preferred label: palveluntuottajat @fi
type: Concept