change
preferred label: förändring @sv
preferred label: muutos @fi
type: Concept
narrower: falling under the statute of limitations

falling under the statute of limitations
preferred label: vanhentuminen @fi
preferred label: preskription @sv
in scheme: conceptscheme
comment: lainmukaisen määräajan laiminlyömisestä johtuva tietyn oikeuden menetys
broader: change
source: Kielitoimiston sanakirja
type: Concept