battles
preferred label: strider @sv
preferred label: taistelut @fi
type: Concept
narrower: Battles of Svensksund

Russo-Swedish War (1788-1790)
preferred label: Gustaf III:s krig @sv
preferred label: Kustaa III:n sota @fi
type: Concept
related: Battles of Svensksund

Battles of Svensksund
broader: battles
scope note: Kuutsalon ja Tiutisen saarten välisessä Ruotsinsalmessa Kotkan kaakkoispuolella elokuussa 1789 ja heinäkuussa 1790 Ruotsin ja Venäjän laivastojen välillä käydyt meritaistelut
related: Russo-Swedish War (1788-1790)
in scheme: conceptscheme
preferred label: slaget vid Svensksund @sv
preferred label: Ruotsinsalmen taistelut @fi
type: Concept