chemistry
preferred label: kemi @sv
preferred label: kemia @fi
type: Concept
narrower: green chemistry

green chemistry
broader: chemistry
scope note: Tarkoittaa vaarallisten tai haitallisten aineiden käytön vähentämistä kemiallisissa tuotteissa tai prosesseissa
in scheme: conceptscheme
preferred label: vihreä kemia @fi
type: Concept