rymdväder
type: Concept
preferred label: space weather @en
preferred label: avaruussää @fi
broader: väderlek
in scheme: conceptscheme
related: rymdväder
related: substormar
related: magnetiska stormar
scope note: Tarkoittaa maapallon lähiavaruuden vaihtelevia sähkömagneettisia ja hiukkasolosuhteita, jotka voivat vaikuttaa avaruudessa ja maan pinnalla oleviin teknisiin laitteisiin ja olla haitallisia ihmisen terveydelle. Avarussäälle alttiita ovat mm. satelliitit, tietoliikennejärjestelmät, sähköverkot sekä öljy- ja kaasuputket. Avaruussää voi myös vaikuttaa ilmakehään ja siten tavalliseen säähän
scope note: Rymdväder är en sammanfattande benämning på de ständigt skiftande förhållandena i rymdplasmat runt jorden. Rymdväder drivs av helt andra processer än väderförhållanden inom en atmosfär, och handlar mycket om solvinden, magnetosfärer och joniserande strålning i rymden
scope note: avaruusilmasto + avaruussää = rymdväder

magnetiska stormar
preferred label: geomagnetic storms @en
preferred label: magneettiset myrskyt @fi
type: Concept
related: rymdväder

väderlek
preferred label: weather @en
preferred label: sää @fi
type: Concept
narrower: rymdväder

rymdväder
preferred label: space climate @en
preferred label: avaruusilmasto @fi
type: Concept
related: rymdväder

substormar
preferred label: space storms @en
preferred label: avaruusmyrskyt @fi
type: Concept
related: rymdväder