oikeustekniset ilmiöt
preferred label: technical-legal phenomena @en
type: Concept
narrower: oikeusvarmuus

oikeusvarmuus
preferred label: legal certainty @en
preferred label: rättssäkerhet @sv
type: Concept
comment: oikeudellisten ratkaisujen ennakoitavuus, muodollinen oikeusturva; samanlaisten tapausten ratkaiseminen samalla tavoin, muodollinen lainmukaisuus
related: oikeusturva
source: Kielitoimiston sanakirja
in scheme: conceptscheme
broader: oikeustekniset ilmiöt

oikeusturva
preferred label: legal protection @en
preferred label: rättsskydd @sv
type: Concept
related: oikeusvarmuus