literary works
preferred label: kirjalliset teokset @fi
preferred label: litterära verk @sv
type: Concept
narrower: artists' books

artists' books
broader: literary works
scope note: Tarkoittaa kirjanmuotoista taiteilijan tekemää kuvataideteosta
in scheme: conceptscheme
preferred label: bokkonstverk @sv
preferred label: taiteilijakirjat @fi
type: Concept