toimintamuodot
preferred label: verksamhetsformer @sv
preferred label: lines of action @en
related: toimintamallit
comment: muoto: tavasta jolla jk toiminta, teko, ilmiö tms. (ulkonaisesti, käytännössä) ilmenee
in scheme: conceptscheme
source: Kielitoimiston sanakirja
type: Concept
broader: yhteiskunnalliset ilmiöt

toimintamallit
preferred label: verksamhetsmodeller @sv
preferred label: operations models @en
type: Concept
related: toimintamuodot

yhteiskunnalliset ilmiöt
preferred label: societal phenomena @en
type: Concept
narrower: toimintamuodot