artists' homes
preferred label: konstnärshem @sv
preferred label: taiteilijakodit @fi
type: Concept
narrower: Visavuori

Visavuori
broader: artists' homes
scope note: Kuvanveistäjä Emil Wikströmin taiteilijakoti Sääksmäellä
in scheme: conceptscheme
type: Concept