manors
preferred label: herrgårdar @sv
preferred label: kartanot @fi
type: Concept
narrower: Kuokkala manor

Kuokkala manor
broader: manors
scope note: Kartano ja muinaistaidekeskus Jyväskylässä
in scheme: conceptscheme
preferred label: Kuokkalan kartano @fi
type: Concept