Messianic Jews
broader: Judaism
scope note: Messiaaniseen juutalaisuuteen kuuluvat synagoogat noudattavat juutalaista synagoogajumalanpalvelusta, ympärileikkausta ja tapakulttuuria, mutta korostavat historiallisen Jeesuksen messiaanisuutta
in scheme: conceptscheme
preferred label: messiaaniset juutalaiset @fi
type: Concept

Judaism
preferred label: judendom @sv
preferred label: juutalaisuus @fi
type: Concept
narrower: Messianic Jews