Black Death
broader: plague
source: Lähde: CD-Facta
scope note: Rutto, joka surmasi Euroopassa noin 25 miljoonaa ihmistä vuosina 1347-1351
in scheme: conceptscheme
preferred label: musta surma @fi
type: Concept

plague
preferred label: rutto @fi
type: Concept
narrower: Black Death