packningar
source: Suomen kielen perussanakirja
preferred label: sealants @en
preferred label: tiivisteet @fi
in scheme: conceptscheme
comment: esine tai aine, jolla liitoskohta, sauma tms. tiivistetään
type: Concept
broader: byggvaror

byggvaror
preferred label: building components @en
preferred label: rakennustarvikkeet @fi
type: Concept
narrower: packningar