keskuslämmitys
preferred label: centralvärme @sv
preferred label: central heating @en
type: Concept
narrower: öljylämmitys

öljylämmitys
preferred label: oljeeldning @sv
preferred label: oil heating @en
broader: keskuslämmitys
source: Energiasanasto TSK 16
type: Concept
comment: öljyä polttoaineena käyttävä keskuslämmitys
in scheme: conceptscheme