konstnärshem
preferred label: artists' homes @en
preferred label: taiteilijakodit @fi
type: Concept
narrower: Halosenniemi

Halosenniemi
broader: konstnärshem
scope note: Taidemaalari Pekka Halosen taiteilijakoti Tuusulassa. Toimii nykyään museona
in scheme: conceptscheme
type: Concept