maasait
source: Källa: Nationalencyklopedin
source: Kielitoimiston sanakirja
type: Concept
alternative label: masait
alternative label: massait
alternative label: maasai
in scheme: conceptscheme
preferred label: Maasai people @en
preferred label: massajer @sv
scope note: Kirjoitusmuoto tarkistettu Aasian ja Afrikan kielten ja kulttuurien laitokselta (Harri Halen). Kielitoimisto ei osannut sanoa, mikä on oikea kirjoitusmuoto
comment: eräs Keniassa ja Tansaniassa elävä paimentolaisheimo
broader: afrikkalaiset

afrikkalaiset
preferred label: africans @en
preferred label: afrikaner @sv
type: Concept
narrower: maasait