Java
type: Concept
related: ActiveX

ActiveX
broader: technical systems
source: Lähde: Jaakohuhta, H. IT-ensyklopedia
scope note: Microsoftin vuonna 1996 julkaisema oliotekniikka, joka toiminnaltaan vastaa Java-kieltä
related: Java
in scheme: conceptscheme
type: Concept

technical systems
preferred label: tekniset järjestelmät @fi
type: Concept
narrower: ActiveX