miljöbyggande
preferred label: ympäristörakentaminen @fi
preferred label: environmental construction @en
scope note: Ympäristörakentamista ovat ihmisen toiminnallaan aiheuttamien maisemavaurioiden korjaaminen tai ympäristön terveyshaittojen vähentämiseen pyrkivät rakennustoimenpiteet. Ympäristörakentamiseen kuuluvat myös ympäristöarvot säilyttävä viherrakentaminen ja maisemointi sekä rakentamiskohteista mm. kadut, sillat, aukiot, vesiväylät, puistot ja muut viher- ja virkistysalueet, pihat ja puutarhat
scope note: Miljöbyggande avser reparation av skador som människors verksamhet förorsakat miljön eller byggåtgärder som strävar att minska miljöns skadliga hälsoeffekter. Miljöbyggande omfattar också grönområdesplanering för att bevara miljövärden och byggen som gator, broar, öppna platser, vattenleder, parker och övriga grön- och rekreationsområden, gårdar och trädgårdar.
in scheme: conceptscheme
broader: byggande
type: Concept

byggande
preferred label: building @en
preferred label: rakentaminen @fi
type: Concept
narrower: miljöbyggande