marscher
comment: tasajakoinen korosteisen rytminen sävellys, joka us. on tarkoitettu ohjaamaan marssimista
source: Kielitoimiston sanakirja
narrower: sorgmarscher
broader: kompositioner
preferred label: marssit @fi
preferred label: marches @en
in scheme: conceptscheme
type: Concept

kompositioner
preferred label: compositions @en
preferred label: sävellykset @fi
type: Concept
narrower: marscher

sorgmarscher
preferred label: funeral marches @en
preferred label: surumarssit @fi
type: Concept
broader: marscher