sisäiset ominaisuudet
preferred label: inre egenskaper @sv
preferred label: internal qualities @en
type: Concept
narrower: esteettömyys (käytön tai liikkumisen)

esteettömyys (käytön tai liikkumisen)
preferred label: non-impediment @en
preferred label: hinderslöshet @sv
comment: käyttöön, liikkumiseen tms. liittyvä esteettömyys
type: Concept
broader: sisäiset ominaisuudet
in scheme: conceptscheme
alternative label: esteettömyys