property
preferred label: omaisuus @fi
preferred label: egendom @sv
type: Concept
narrower: current assets

current assets
in scheme: conceptscheme
scope note: Sisältää kirjanpitolain mukaan raaka-aineina, puolivalmisteina ja valmiina tuotteina luovutettavaksi tai kulutettaviksi tarkoitetut hyödykkeet
preferred label: vaihto-omaisuus @fi
preferred label: omsättningstillgångar @sv
type: Concept
source: Lähde: Suomen kielen perussanakirja; Taloussanasto
broader: property