sales
preferred label: försäljning @sv
preferred label: myynti @fi
type: Concept
narrower: disinvestments

capital expenditure
preferred label: investeringar @sv
preferred label: investoinnit @fi
type: Concept
related: disinvestments

disinvestments
broader: sales
related: capital expenditure
preferred label: divestoinnit @fi
preferred label: deinvesteringar @sv
alternative label: divestments
comment: yritysmyynti, jossa yhtiöstä myydään tietyt liiketoiminnot ulkopuoliselle yritysostajalle
type: Concept
source: Jari Lauriala / LTY
in scheme: conceptscheme