rälssitilat
preferred label: frälsehemman @sv
preferred label: freehold estates @en
type: Concept
narrower: Ylistalo

Ylistalo
broader: rälssitilat
source: Lähde: Laajasalon Ylistalon historiaa
scope note: Ylistalo on entinen rälssitila Helsingin Laajasalossa, ny- kyisin Laajasalo-Degerö-seuran kotiseututalo
preferred label: Uppbyhus
in scheme: conceptscheme
type: Concept