alteration
preferred label: förvandling @sv
preferred label: toisenlaiseksi muuttaminen @fi
type: Concept
narrower: stamping

stamping
preferred label: leimaus @fi
preferred label: stämpling @sv
alternative label: leimaaminen @fi
alternative label: marking
source: Suomen kielen perussanakirja
comment: lyödä, painaa tai muuten tehdä johonkin leima tai leimoja
type: Concept
broader: alteration
in scheme: conceptscheme