kaktukset
preferred label: kaktusväxter @sv
preferred label: cacti @en
type: Concept
related: mehikasvit

mehikasvit
preferred label: succulents @en
preferred label: suckulenter @sv
source: Biologian sanakirja
in scheme: conceptscheme
comment: sukkulentit; kasveja, joille ovat tyypillisiä vettä varastoivat solukot juurissa, varressa tai lehdissä: tästä johtuu mehikasvien paksu, turpea ulkomuoto.
related: kaktukset
type: Concept
broader: kasvit

kasvit
preferred label: plants @en
preferred label: växter @sv
type: Concept
narrower: mehikasvit

kasvit rakenteen mukaan
type: Collection
member: mehikasvit