valtionkirkko
preferred label: state church @en
preferred label: statskyrka @sv
comment: valtiosta hallinnollisesti ja taloudellisesti riippuvainen kirkkokunta
broader: kirkko
type: Concept
alternative label: valtiokirkko
source: Kielitoimiston sanakirja
in scheme: conceptscheme

kirkko
preferred label: church @en
preferred label: kyrkan @sv
type: Concept
narrower: valtionkirkko