kaivokset
preferred label: gruvor @sv
preferred label: mines @en
scope note: Olika gruvor indexeras enligt produktion; t.ex. gruvor : stenkol @sv
scope note: Eri kaivokset indeksoidaan tuotteensa mukaan esim. kaivokset -- kivihiili
in scheme: conceptscheme
related: louhokset
type: Concept
broader: ihmisen määrittämä paikka

ihmisen määrittämä paikka
preferred label: place defined by human @en
type: Concept
narrower: kaivokset

louhokset
preferred label: quarries @en
preferred label: stenbrott @sv
type: Concept
related: kaivokset