torpat
preferred label: crofts @en
preferred label: torp @sv
type: Concept
narrower: Tiaisen kruununmetsätorppa

Tiaisen kruununmetsätorppa
broader: torpat
source: Lähde: Tervonen, P., Tiaisen kruununmetsätorpasta Alanteen tilaksi
scope note: Torppa sijaitsee Puolangalla Auhon kylässä. Torppa perustettiin 1800-luvun lopulla, ja se itsenäistyi 1931. Myöhemmin torpasta tuli valtionasutustila ja sen nimeksi tuli Alanne
in scheme: conceptscheme
preferred label: Tiainen kronoskogstorp @sv
type: Concept