tömning
preferred label: emptying @en
preferred label: tyhjennys @fi
comment: 1) kohteena tila, josta jotakin poistetaan; 2) kohteena se, mikä jostakin poistetaan
source: Suomen kielen perussanakirja
broader: förvandling
in scheme: conceptscheme
type: Concept

förvandling
preferred label: alteration @en
preferred label: toisenlaiseksi muuttaminen @fi
type: Concept
narrower: tömning